Back to Multiple platform build/check report for BioC 3.22:   simplified   long
ABCDEFGHIJKLMNOPQRSTU[V]WXYZ

This page was generated on 2025-08-30 12:08 -0400 (Sat, 30 Aug 2025).

HostnameOSArch (*)R versionInstalled pkgs
nebbiolo2Linux (Ubuntu 24.04.3 LTS)x86_644.5.1 (2025-06-13) -- "Great Square Root" 4824
lconwaymacOS 12.7.1 Montereyx86_644.5.1 (2025-06-13) -- "Great Square Root" 4615
kjohnson3macOS 13.7.7 Venturaarm644.5.1 Patched (2025-06-14 r88325) -- "Great Square Root" 4562
taishanLinux (openEuler 24.03 LTS)aarch644.5.0 (2025-04-11) -- "How About a Twenty-Six" 4541
Click on any hostname to see more info about the system (e.g. compilers)      (*) as reported by 'uname -p', except on Windows and Mac OS X

Package 2262/2320HostnameOS / ArchINSTALLBUILDCHECKBUILD BIN
variancePartition 1.39.1  (landing page)
Gabriel E. Hoffman
Snapshot Date: 2025-08-29 13:45 -0400 (Fri, 29 Aug 2025)
git_url: https://git.bioconductor.org/packages/variancePartition
git_branch: devel
git_last_commit: c6739b4
git_last_commit_date: 2025-08-19 21:04:41 -0400 (Tue, 19 Aug 2025)
nebbiolo2Linux (Ubuntu 24.04.3 LTS) / x86_64  OK    OK    ERROR  
lconwaymacOS 12.7.1 Monterey / x86_64  OK    OK    ERROR    OK  
kjohnson3macOS 13.7.7 Ventura / arm64  OK    OK    ERROR    OK  
taishanLinux (openEuler 24.03 LTS) / aarch64  OK    OK    OK  


CHECK results for variancePartition on kjohnson3

To the developers/maintainers of the variancePartition package:
- Allow up to 24 hours (and sometimes 48 hours) for your latest push to git@git.bioconductor.org:packages/variancePartition.git to reflect on this report. See Troubleshooting Build Report for more information.
- Use the following Renviron settings to reproduce errors and warnings.
- If 'R CMD check' started to fail recently on the Linux builder(s) over a missing dependency, add the missing dependency to 'Suggests:' in your DESCRIPTION file. See Renviron.bioc for more information.

raw results


Summary

Package: variancePartition
Version: 1.39.1
Command: /Library/Frameworks/R.framework/Resources/bin/R CMD check --install=check:variancePartition.install-out.txt --library=/Library/Frameworks/R.framework/Resources/library --no-vignettes --timings variancePartition_1.39.1.tar.gz
StartedAt: 2025-08-29 22:16:29 -0400 (Fri, 29 Aug 2025)
EndedAt: 2025-08-29 22:19:23 -0400 (Fri, 29 Aug 2025)
EllapsedTime: 174.1 seconds
RetCode: 1
Status:   ERROR  
CheckDir: variancePartition.Rcheck
Warnings: NA

Command output

##############################################################################
##############################################################################
###
### Running command:
###
###   /Library/Frameworks/R.framework/Resources/bin/R CMD check --install=check:variancePartition.install-out.txt --library=/Library/Frameworks/R.framework/Resources/library --no-vignettes --timings variancePartition_1.39.1.tar.gz
###
##############################################################################
##############################################################################


* using log directory ‘/Users/biocbuild/bbs-3.22-bioc/meat/variancePartition.Rcheck’
* using R version 4.5.1 Patched (2025-06-14 r88325)
* using platform: aarch64-apple-darwin20
* R was compiled by
    Apple clang version 16.0.0 (clang-1600.0.26.6)
    GNU Fortran (GCC) 14.2.0
* running under: macOS Ventura 13.7.7
* using session charset: UTF-8
* using option ‘--no-vignettes’
* checking for file ‘variancePartition/DESCRIPTION’ ... OK
* checking extension type ... Package
* this is package ‘variancePartition’ version ‘1.39.1’
* package encoding: UTF-8
* checking package namespace information ... OK
* checking package dependencies ... OK
* checking if this is a source package ... OK
* checking if there is a namespace ... OK
* checking for hidden files and directories ... OK
* checking for portable file names ... OK
* checking for sufficient/correct file permissions ... OK
* checking whether package ‘variancePartition’ can be installed ... OK
* checking installed package size ... OK
* checking package directory ... OK
* checking ‘build’ directory ... OK
* checking DESCRIPTION meta-information ... OK
* checking top-level files ... OK
* checking for left-over files ... OK
* checking index information ... OK
* checking package subdirectories ... OK
* checking code files for non-ASCII characters ... OK
* checking R files for syntax errors ... OK
* checking whether the package can be loaded ... OK
* checking whether the package can be loaded with stated dependencies ... OK
* checking whether the package can be unloaded cleanly ... OK
* checking whether the namespace can be loaded with stated dependencies ... OK
* checking whether the namespace can be unloaded cleanly ... OK
* checking dependencies in R code ... NOTE
Unexported object imported by a ':::' call: ‘lmerTest:::as_lmerModLT’
  See the note in ?`:::` about the use of this operator.
* checking S3 generic/method consistency ... OK
* checking replacement functions ... OK
* checking foreign function calls ... OK
* checking R code for possible problems ... OK
* checking Rd files ... OK
* checking Rd metadata ... OK
* checking Rd cross-references ... OK
* checking for missing documentation entries ... OK
* checking for code/documentation mismatches ... OK
* checking Rd \usage sections ... NOTE
S3 methods shown with full name in Rd file 'residuals.MArrayLM2.Rd':
  ‘residuals.MArrayLM2’

The \usage entries for S3 methods should use the \method markup and not
their full name.
See chapter ‘Writing R documentation files’ in the ‘Writing R
Extensions’ manual.
* checking Rd contents ... OK
* checking for unstated dependencies in examples ... OK
* checking contents of ‘data’ directory ... OK
* checking data for non-ASCII characters ... OK
* checking data for ASCII and uncompressed saves ... OK
* checking files in ‘vignettes’ ... NOTE
The following directory looks like a leftover from 'knitr':
  ‘figure’
Please remove from your package.
* checking examples ... OK
Examples with CPU (user + system) or elapsed time > 5s
                               user system elapsed
fitVarPartModel-method        8.788  0.013   8.808
fitExtractVarPartModel-method 7.041  0.010   7.056
getTreat-method               6.249  0.014   6.265
dream-method                  1.141  0.037   6.673
* checking for unstated dependencies in ‘tests’ ... OK
* checking tests ...
  Running ‘runTests.R’
 ERROR
Running the tests in ‘tests/runTests.R’ failed.
Last 13 lines of output:
  FAILURE in test_voomWithDreamWeights: Error in checkEquals(vobj1, vobj2) : 
    Length mismatch: comparison on first 4 components
  Component "weights": Mean relative difference: 0.06105003
  
  
  Test files with failing tests
  
     test_voomWithDreamWeights.R 
       test_reweigthing_voom 
       test_voomWithDreamWeights 
  
  
  Error in BiocGenerics:::testPackage("variancePartition") : 
    unit tests failed for package variancePartition
  Execution halted
* checking for unstated dependencies in vignettes ... OK
* checking package vignettes ... OK
* checking running R code from vignettes ... SKIPPED
* checking re-building of vignette outputs ... SKIPPED
* checking PDF version of manual ... OK
* DONE

Status: 1 ERROR, 3 NOTEs
See
  ‘/Users/biocbuild/bbs-3.22-bioc/meat/variancePartition.Rcheck/00check.log’
for details.


Installation output

variancePartition.Rcheck/00install.out

##############################################################################
##############################################################################
###
### Running command:
###
###   /Library/Frameworks/R.framework/Resources/bin/R CMD INSTALL variancePartition
###
##############################################################################
##############################################################################


* installing to library ‘/Library/Frameworks/R.framework/Versions/4.5-arm64/Resources/library’
* installing *source* package ‘variancePartition’ ...
** this is package ‘variancePartition’ version ‘1.39.1’
** using staged installation
** R
** data
** inst
** byte-compile and prepare package for lazy loading
in method for ‘calcVarPart’ with signature ‘"negbin"’: no definition for class “negbin”
in method for ‘checkModelStatus’ with signature ‘"negbin"’: no definition for class “negbin”
Creating a new generic function for ‘eBayes’ in package ‘variancePartition’
Creating a new generic function for ‘classifyTestsF’ in package ‘variancePartition’
Creating a new generic function for ‘topTable’ in package ‘variancePartition’
** help
Loading required namespace: variancePartition
*** installing help indices
*** copying figures
** building package indices
** installing vignettes
** testing if installed package can be loaded from temporary location
** testing if installed package can be loaded from final location
** testing if installed package keeps a record of temporary installation path
* DONE (variancePartition)

Tests output

variancePartition.Rcheck/tests/runTests.Rout.fail


R version 4.5.1 Patched (2025-06-14 r88325) -- "Great Square Root"
Copyright (C) 2025 The R Foundation for Statistical Computing
Platform: aarch64-apple-darwin20

R is free software and comes with ABSOLUTELY NO WARRANTY.
You are welcome to redistribute it under certain conditions.
Type 'license()' or 'licence()' for distribution details.

R is a collaborative project with many contributors.
Type 'contributors()' for more information and
'citation()' on how to cite R or R packages in publications.

Type 'demo()' for some demos, 'help()' for on-line help, or
'help.start()' for an HTML browser interface to help.
Type 'q()' to quit R.

> BiocGenerics:::testPackage("variancePartition")

Attaching package: 'variancePartition'

The following objects are masked from 'package:limma':

    eBayes, topTable

Loading required package: lme4
Loading required package: Matrix

Attaching package: 'lmerTest'

The following object is masked from 'package:lme4':

    lmer

The following object is masked from 'package:stats':

    step

boundary (singular) fit: see help('isSingular')
boundary (singular) fit: see help('isSingular')
Removing intercept from test coefficients
Removing intercept from test coefficients
Removing intercept from test coefficients
Removing intercept from test coefficients
boundary (singular) fit: see help('isSingular')
boundary (singular) fit: see help('isSingular')
boundary (singular) fit: see help('isSingular')
boundary (singular) fit: see help('isSingular')
boundary (singular) fit: see help('isSingular')
boundary (singular) fit: see help('isSingular')
boundary (singular) fit: see help('isSingular')
boundary (singular) fit: see help('isSingular')
boundary (singular) fit: see help('isSingular')
boundary (singular) fit: see help('isSingular')
boundary (singular) fit: see help('isSingular')
boundary (singular) fit: see help('isSingular')
boundary (singular) fit: see help('isSingular')
boundary (singular) fit: see help('isSingular')
boundary (singular) fit: see help('isSingular')
boundary (singular) fit: see help('isSingular')
boundary (singular) fit: see help('isSingular')
boundary (singular) fit: see help('isSingular')
Removing intercept from test coefficients
Removing intercept from test coefficients
Loading required package: Rcpp
Loading required package: zigg
Loading required package: RcppParallel

Attaching package: 'RcppParallel'

The following object is masked from 'package:Rcpp':

    LdFlags


Rfast: 2.1.5.1
 ___ __ __ __ __    __ __ __ __ __ _             _               __ __ __ __ __     __ __ __ __ __ __   
|  __ __ __ __  |  |  __ __ __ __ _/            / \             |  __ __ __ __ /   /__ __ _   _ __ __\  
| |           | |  | |                         / _ \            | |                        / /          
| |           | |  | |                        / / \ \           | |                       / /          
| |           | |  | |                       / /   \ \          | |                      / /          
| |__ __ __ __| |  | |__ __ __ __           / /     \ \         | |__ __ __ __ _        / /__/\          
|    __ __ __ __|  |  __ __ __ __|         / /__ _ __\ \        |_ __ __ __ _   |      / ___  /           
|   \              | |                    / _ _ _ _ _ _ \                     | |      \/  / /       
| |\ \             | |                   / /           \ \                    | |         / /          
| | \ \            | |                  / /             \ \                   | |        / /          
| |  \ \           | |                 / /               \ \                  | |       / /          
| |   \ \__ __ _   | |                / /                 \ \     _ __ __ __ _| |      / /          
|_|    \__ __ __\  |_|               /_/                   \_\   /_ __ __ __ ___|      \/             team

Attaching package: 'Rfast'

The following object is masked from 'package:edgeR':

    gini

Warning: 
Variables contain NA's: Disease 
Samples with missing data will be dropped.

Timing stopped at: 1.104 0.081 1.187
Error in checkEqualsNumeric(vobj1$weights, vobj2$weights) : 
  Mean relative difference: 0.0838729

In addition: There were 32 warnings (use warnings() to see them)
Timing stopped at: 0.278 0.024 0.302
Error in checkEquals(vobj1, vobj2) : 
  Length mismatch: comparison on first 4 components
Component "weights": Mean relative difference: 0.06105003



RUNIT TEST PROTOCOL -- Fri Aug 29 22:19:18 2025 
*********************************************** 
Number of test functions: 31 
Number of errors: 0 
Number of failures: 2 

 
1 Test Suite : 
variancePartition RUnit Tests - 31 test functions, 0 errors, 2 failures
FAILURE in test_reweigthing_voom: Error in checkEqualsNumeric(vobj1$weights, vobj2$weights) : 
  Mean relative difference: 0.0838729

FAILURE in test_voomWithDreamWeights: Error in checkEquals(vobj1, vobj2) : 
  Length mismatch: comparison on first 4 components
Component "weights": Mean relative difference: 0.06105003


Test files with failing tests

   test_voomWithDreamWeights.R 
     test_reweigthing_voom 
     test_voomWithDreamWeights 


Error in BiocGenerics:::testPackage("variancePartition") : 
  unit tests failed for package variancePartition
Execution halted

Example timings

variancePartition.Rcheck/variancePartition-Ex.timings

nameusersystemelapsed
ESS-method0.0530.0040.058
as.data.frame.varPartResults0.1010.0020.103
as.matrix-varPartResults-method0.0820.0010.083
augmentPriorCount0.4650.0270.491
calcVarPart-method0.0180.0010.020
canCorPairs0.0280.0030.032
colinearityScore0.1390.0050.144
deviation-method0.3990.0380.441
diffVar-method0.5960.0400.635
dream-method1.1410.0376.673
extractVarPart4.3380.0144.370
fitExtractVarPartModel-method7.0410.0107.056
fitVarPartModel-method8.7880.0138.808
getContrast-method0.0030.0010.003
getTreat-method6.2490.0146.265
get_prediction-method0.0230.0030.027
ggColorHue000
makeContrastsDream0.4210.0020.423
mvTest-method1.7450.0363.846
plotCompareP-method4.5850.0134.623
plotContrasts0.0510.0020.052
plotCorrMatrix0.0210.0020.024
plotCorrStructure0.2590.0070.266
plotPercentBars-method2.3560.0062.395
plotStratify0.1890.0020.191
plotStratifyBy0.2000.0040.207
plotVarPart-method2.2230.0052.246
rdf0.0090.0000.009
rdf.merMod0.0160.0010.016
residuals-VarParFitList-method2.0940.0042.111
sortCols-method2.2980.0042.308
varPartConfInf3.0590.0053.068
vcovSqrt-method0.0050.0010.006
voomWithDreamWeights1.1010.0341.135